{"text_format":"3","workbook":"xlsx","n_sheets":22,"sheets":["Cover","Ranks & Ratings","Ratings Over Time","Ranks Over Time","Associate Centres","Mean - Top 5 by Region","Top 5","Centres to be More Significant","Areas of Competitiveness","Profiles","Western Europe","Eastern Europe & Central Asia","Asia&Pacific","North America","Latin America & the Caribbean","Middle East & Africa ","Industry Sectors","Reputation","Stability","Assessments","Respondents","Inst Factors"],"not_rendered":{"charts":9,"images":2,"external_links":1,"defined_names":9},"read":"whole","date_system":"1900"}

{"sheet":"Cover","index":0,"n_rows":0,"n_cols":0,"rows_kept":0}

{"sheet":"Ranks & Ratings","index":1,"n_rows":87,"n_cols":8,"rows_kept":87}
["City","GFCI 19 Rank","GFCI 19 Rating","GFCI 18 Rank","GFCI 18 Rating","Change in Rank","Change in Rating","Region"]
["London",1,800,1,796,"-","▲4","Western Europe"]
["New York",2,792,2,788,"-","▲4","North America"]
["Singapore",3,755,4,750,"▲1","▲5","Asia/Pacific"]
["Hong Kong",4,753,3,755,"▼1","▼2","Asia/Pacific"]
["Tokyo",5,728,5,725,"-","▲3","Asia/Pacific"]
["Zurich",6,714,7,715,"▲1","▼1","Western Europe"]
["Washington DC",7,712,10,711,"▲3","▲1","North America"]
["San Francisco",8,711,9,712,"▲1","▼1","North America"]
["Boston",9,709,12,709,"▲3","-","North America"]
{"$rows_left_out":78}
{"sheet":"Ratings Over Time","index":2,"n_rows":89,"n_cols":20,"rows_kept":89}
["Centre","GFCI 1","GFCI 2","GFCI 3","GFCI 4","GFCI 5","GFCI 6","GFCI 7","GFCI 8","GFCI 9","GFCI 10","GFCI 11","GFCI 12","GFCI 13","GFCI 14","GFCI 15","GFCI 16","GFCI 17","GFCI 18","GFCI 19"]
["London",765,806,795,791,781,790,775,772,775,774,781,785,807,794,784,777,784,796,800]
["New York",760,787,786,774,768,774,775,770,769,773,772,765,787,779,786,778,785,788,792]
["Singapore",661,673,675,701,687,719,733,728,722,735,729,725,759,751,751,746,754,750,755]
["Hong Kong",685,697,695,700,684,729,739,760,759,770,754,733,761,759,761,756,758,755,753]
["Tokyo",633,625,628,642,611,674,692,697,694,695,693,684,718,720,722,718,722,725,728]
["Zurich",656,666,665,676,659,676,677,669,665,686,689,691,723,718,730,717,719,715,714]
["Washington DC",594,589,597,600,596,630,647,649,650,670,677,672,692,689,706,704,703,711,712]
["San Francisco",611,608,614,620,609,634,651,654,655,681,683,678,695,697,711,719,708,712,711]
["Boston",609,621,618,625,618,634,652,655,656,678,684,680,711,714,715,705,706,709,709]
{"$rows_left_out":80}
{"sheet":"Ranks Over Time","index":3,"n_rows":89,"n_cols":20,"rows_kept":89}
["Centre","GFCI 1","GFCI 2","GFCI 3","GFCI 4","GFCI 5","GFCI 6","GFCI 7","GFCI 8","GFCI 9","GFCI 10","GFCI 11","GFCI 12","GFCI 13","GFCI 14","GFCI 15","GFCI 16","GFCI 17","GFCI 18","GFCI 19"]
["London",1,1,1,1,1,1,1,1,1,1,1,1,1,1,2,2,2,1,1]
["New York",2,2,2,2,2,2,1,2,2,2,2,2,2,2,1,1,1,2,2]
["Singapore",4,4,4,3,3,4,4,4,4,4,4,4,4,4,4,4,4,4,3]
["Hong Kong",3,3,3,4,4,3,3,3,3,3,3,3,3,3,3,3,3,3,4]
["Tokyo",9,10,9,7,15,7,5,5,5,6,5,7,6,5,6,6,5,5,5]
["Zurich",5,5,5,5,5,6,7,8,8,8,6,5,5,6,5,7,6,7,6]
["Washington DC",19,18,20,22,21,19,17,17,17,14,15,14,14,17,13,10,12,10,7]
["San Francisco",13,14,12,17,17,17,15,14,13,9,12,12,13,12,10,5,8,9,8]
["Boston",14,12,11,11,9,17,14,13,12,12,11,11,8,7,8,9,10,12,9]
{"$rows_left_out":80}
{"sheet":"Associate Centres","index":4,"n_rows":17,"n_cols":3,"rows_kept":17}
["Centre","Assessments in the last 24 Months ","Mean"]
["Guangzhou",162,{"v":685.1851851851852,"d":"685"}]
["New Delhi",116,{"v":553.448275862069,"d":"553"}]
["Baku",103,{"v":501.94174757281553,"d":"502"}]
["Tianjin",100,669]
["Trinidad and Tobago",100,593]
["Buenos Aires",87,{"v":529.8850574712643,"d":"530"}]
["Sofia",85,{"v":543.5294117647059,"d":"544"}]
["Nairobi",78,{"v":501.28205128205127,"d":"501"}]
["Santiago",69,{"v":634.7826086956521,"d":"635"}]
{"$rows_left_out":8}
{"sheet":"Mean - Top 5 by Region","index":5,"n_rows":7,"n_cols":20,"rows_kept":7}
["Centre","GFCI 1","GFCI 2","GFCI 3","GFCI 4","GFCI 5","GFCI 6","GFCI 7","GFCI 8","GFCI 9","GFCI 10","GFCI 11","GFCI 12","GFCI 13","GFCI 14","GFCI 15","GFCI 16","GFCI 17","GFCI 18","GFCI 19"]
["Asia/Pacific",{"v":597.8,"d":"598"},{"v":597.2,"d":"597"},{"v":601.4,"d":"601"},{"v":622.6,"d":"623"},{"v":596.4,"d":"596"},{"v":670.6,"d":"671"},{"v":689.4,"d":"689"},681,682,698,{"v":709.8,"d":"710"},{"v":696.6,"d":"697"},{"v":724.4,"d":"724"},{"v":724.2,"d":"724"},{"v":729.4,"d":"729"},725,724,732,731]
["Eastern Europe and Central Asia",{"v":455.5,"d":"456"},446,435,434,{"v":388.5,"d":"389"},{"v":460.75,"d":"461"},{"v":508.5,"d":"509"},{"v":511.75,"d":"512"},{"v":520.75,"d":"521"},583,{"v":591.25,"d":"591"},{"v":594.25,"d":"594"},{"v":607.5,"d":"608"},{"v":572.75,"d":"573"},{"v":607.6,"d":"608"},{"v":628.6,"d":"629"},613,638,621]
["Latin America & the Caribbean",450,434,{"v":512.5,"d":"513"},{"v":527.5,"d":"528"},{"v":494.5,"d":"495"},{"v":544.8,"d":"545"},570,{"v":561.4,"d":"561"},{"v":561.4,"d":"561"},{"v":601.6,"d":"602"},606,{"v":606.2,"d":"606"},{"v":636.8,"d":"637"},627,{"v":653.4,"d":"653"},{"v":652.8,"d":"653"},650,665,636]
["Middle East & Africa",570,{"v":507.5,"d":"508"},538,561,{"v":543.5,"d":"544"},544,575,{"v":567.3333333333334,"d":"567"},{"v":567.3333333333334,"d":"567"},611,{"v":615.25,"d":"615"},{"v":624.25,"d":"624"},{"v":660.25,"d":"660"},652,{"v":684.6,"d":"685"},{"v":683.8,"d":"684"},{"v":689.2,"d":"689"},687,673]
["North America",{"v":637.6,"d":"638"},{"v":643.6,"d":"644"},645,{"v":648.6,"d":"649"},{"v":641.2,"d":"641"},{"v":663.8,"d":"664"},{"v":678.4,"d":"678"},{"v":676.8,"d":"677"},{"v":677.6,"d":"678"},{"v":696.4,"d":"696"},{"v":700.2,"d":"700"},{"v":695.2,"d":"695"},{"v":716.2,"d":"716"},{"v":715.6,"d":"716"},{"v":724.6,"d":"725"},{"v":721.8,"d":"722"},{"v":721.2,"d":"721"},727,724]
["Western Europe",653,{"v":672.4,"d":"672"},{"v":669.4,"d":"669"},674,{"v":664.6,"d":"665"},{"v":682.4,"d":"682"},{"v":685.2,"d":"685"},679,{"v":676.6,"d":"677"},{"v":687.2,"d":"687"},{"v":695.6,"d":"696"},{"v":696.2,"d":"696"},{"v":726.4,"d":"726"},724,{"v":728.6,"d":"729"},{"v":717.4,"d":"717"},{"v":718.2,"d":"718"},725,719]

{"sheet":"Top 5","index":6,"n_rows":6,"n_cols":20,"rows_kept":6}
["Centre","GFCI 1","GFCI 2","GFCI 3","GFCI 4","GFCI 5","GFCI 6","GFCI 7","GFCI 8","GFCI 9","GFCI 10","GFCI 11","GFCI 12","GFCI 13","GFCI 14","GFCI 15","GFCI 16","GFCI 17","GFCI18","GFCI 19"]
["London",765,806,795,791,781,790,775,772,775,774,781,785,807,794,784,777,784,796,800]
["New York",760,787,786,774,768,774,775,770,769,773,772,765,787,779,786,778,785,788,792]
["Hong Kong",685,697,695,700,684,729,739,760,759,770,754,733,761,759,761,756,758,755,753]
["Singapore",661,673,675,700,683,719,733,728,722,735,729,725,759,751,751,746,754,750,755]
["Tokyo",633,625,628,642,611,674,692,697,694,695,693,684,718,720,722,718,722,725,728]

{"sheet":"Centres to be More Significant","index":7,"n_rows":17,"n_cols":2,"rows_kept":17}
["Centre","Mentions within past 24 months"]
["Shanghai",105]
["Singapore",89]
["Casablanca",76]
["Hong Kong",62]
["Dalian",46]
["Dubai",40]
["London",33]
["Shenzhen",30]
["Gibraltar",29]
{"$rows_left_out":8}
{"sheet":"Areas of Competitiveness","index":8,"n_rows":26,"n_cols":6,"rows_kept":26,"merged":[[13,2,13,4],[14,0,15,0],[14,1,15,1],[14,2,14,4],[15,2,15,4],[16,0,17,0],[16,1,17,1],[16,2,16,4],[17,2,17,4],[18,0,19,0],[18,1,19,1],[18,2,18,4],[19,2,19,4],[20,0,21,0],[20,1,21,1],[20,2,20,4],[21,2,21,4],[22,0,23,0],[22,1,23,1],[22,2,22,4],[23,2,23,4],[24,0,25,0],[24,1,25,1],[24,2,24,4],[25,2,25,4]]}
["Rank","Business Environment","Financial Sector Development","Infrastructure","Human Capital","Reputational & General"]
[1,"London (-)","London (-)","London (-)","London (-)","London (-)"]
[2,"New York (-)","New York (-)","New York (-)","New York (-)","New York (-)"]
[3,"Hong Kong (-)","Hong Kong (-)","Hong Kong (-)","Singapore (+1)","Hong Kong (-)"]
[4,"Singapore (-)","Singapore (-)","Singapore (-)","Hong Kong (-1)","Singapore (-)"]
[5,"Los Angeles (+31)","Tokyo (-)","Tokyo (-)","Los Angeles (+34)","Washington DC (+8)"]
[6,"Chicago (+4)","Boston (-)","San Francisco (+7)","Tokyo (-1)","Chicago (+1)"]
[7,"Tokyo (-2)","San Francisco (-)","Zurich (-)","Chicago (+1)","Los Angeles (+28)"]
[8,"Toronto (+1)","Chicago (-2)","Seoul (-2)","San Francisco (-2)","Sydney (-2)"]
[9,"Sydney (+2)","Washington DC (-2)","Sydney (+2)","Washington DC (-)","San Francisco (-)"]
{"$rows_left_out":17}
{"sheet":"Profiles","index":9,"n_rows":48,"n_cols":5,"rows_kept":48,"merged":[[1,0,13,0],[14,0,31,0],[32,0,50,0]]}
[null,"Broad & Deep","Relatively Broad  ","Relatively Deep  ","Emerging"]
["Global","Global Leaders","Global Diversified ","Global Specialists","Global Contenders"]
[null,"Amsterdam","Brussels","Beijing","Jersey"]
[null,"Dublin","Shanghai","Dubai"]
[null,"Frankfurt",null,"Luxembourg"]
[null,"Geneva",null,"Moscow"]
[null,"Hong Kong"]
[null,"London"]
[null,"New York"]
[null,"Paris"]
{"$rows_left_out":39}
{"sheet":"Western Europe","index":10,"n_rows":61,"n_cols":20,"rows_kept":61}
["Centre","GFCI 1","GFCI 2","GFCI 3","GFCI 4","GFCI 5","GFCI 6","GFCI 7","GFCI 8","GFCI 9","GFCI 10","GFCI 11","GFCI 12","GFCI 13","GFCI 14","GFCI 15","GFCI 16","GFCI 17","GFCI 18","GFCI 19"]
["Developed",653,{"v":672.4,"d":"672"},669.4,674,{"v":664.6,"d":"665"},682.4,685.2,679,676.6,687.2,{"v":695.6,"d":"696"},696.2,726.4,724,728.6]
["Emerging ",{"$error":"#DIV/0!"},{"v":827.5185518379909,"d":"828"},-6.641014389739524,841.8987341772151,{"v":7.739167949484681,"d":"8"},{"$error":"#DIV/0!"},{"$error":"#DIV/0!"},{"$error":"#DIV/0!"},{"$error":"#DIV/0!"},{"$error":"#DIV/0!"},{"$error":"#DIV/0!"},{"$error":"#DIV/0!"},{"$error":"#DIV/0!"},{"$error":"#DIV/0!"},{"$error":"#DIV/0!"}]
["London",765,806,795,791,781,790,775,772,775,774,781,785,807,794,784,777,784,796,800]
["Zurich",656,666,665,676,659,676,677,669,665,686,689,691,723,718,730,717,719,715,714]
["Luxembourg",570,596,605,622,612,637,643,634,630,637,648,646,687,696,707,697,694,700,698]
["Geneva",627,645,640,645,638,660,671,661,659,672,679,682,712,710,713,701,702,707,694]
["Frankfurt",647,649,642,636,633,649,660,659,654,667,681,677,703,702,709,695,692,706,689]
["Dublin",578,605,613,622,618,613,612,605,592,614,621,618,627,605,616,607,627,654,643]
{"$rows_empty":22}
{"$rows_left_out":31}
{"sheet":"Eastern Europe & Central Asia","index":11,"n_rows":43,"n_cols":20,"rows_kept":43}
["Centre","GFCI 1","GFCI 2","GFCI 3","GFCI 4","GFCI 5","GFCI 6","GFCI 7","GFCI 8","GFCI 9","GFCI 10","GFCI 11","GFCI 12","GFCI 13","GFCI 14","GFCI 15","GFCI 16","GFCI 17","GFCI 18","GFCI 19"]
["Developed",{"$f":"AVERAGE(B5:B22)","v":443.3333333333333},{"v":435.6666666666667,"d":"436"},431,427.3333333333333,380,470,526.3333333333334,522,530.3333333333334,593,597,595.6666666666666,608.3333333333334,572,602]
["Emerging ",{"$f":"AVERAGE(#REF!)","v":{"$error":"#REF!"}},{"$f":"AVERAGE(#REF!)","v":{"$error":"#REF!"}},{"$f":"AVERAGE(#REF!)","v":{"$error":"#REF!"}},{"$f":"AVERAGE(#REF!)","v":{"$error":"#REF!"}},{"$f":"AVERAGE(#REF!)","v":{"$error":"#REF!"}},{"$f":"AVERAGE(#REF!)","v":{"$error":"#REF!"}},{"$f":"AVERAGE(#REF!)","v":{"$error":"#REF!"}},{"$f":"AVERAGE(#REF!)","v":{"$error":"#REF!"}},{"$f":"AVERAGE(#REF!)","v":{"$error":"#REF!"}},{"$f":"AVERAGE(#REF!)","v":{"$error":"#REF!"}},{"$f":"AVERAGE(#REF!)","v":{"$error":"#REF!"}},{"$f":"AVERAGE(#REF!)","v":{"$error":"#REF!"}},{"$f":"AVERAGE(#REF!)","v":{"$error":"#REF!"}},{"$f":"AVERAGE(#REF!)","v":{"$error":"#REF!"}},{"$f":"AVERAGE(#REF!)","v":{"$error":"#REF!"}}]
["Istanbul",{"$nulls":5},442,470,496,494,580,590,601,626,633,651,655,643,653,636]
["Warsaw",459,438,433,424,381,456,520,517,538,593,606,598,608,571,626,612,606,663,631]
["Prague",452,454,437,444,396,492,543,543,547,605,602,604,611,565,589,623,613,623,622]
["Moscow",419,415,423,414,363,462,516,506,506,581,583,585,606,580,591,536,579,598,611]
["Riga",{"$nulls":17},605,605]
{"$rows_empty":23}
["City","GFCI 19 Rank","GFCI 19 Rating","GFCI 18 Rank","GFCI 18 Rating","Change in Rank","Change in Rating"]
{"$rows_left_out":12}
{"sheet":"Asia&Pacific","index":12,"n_rows":52,"n_cols":20,"rows_kept":52}
["Centre","GFCI 1","GFCI 2","GFCI 3","GFCI 4","GFCI 5","GFCI 6","GFCI 7","GFCI 8","GFCI 9","GFCI 10","GFCI 11","GFCI 12","GFCI 13","GFCI 14","GFCI 15","GFCI 16","GFCI 17","GFCI 18","GFCI 19"]
["Developed",{"$error":"#DIV/0!"},{"$error":"#DIV/0!"},{"$error":"#DIV/0!"},{"$error":"#DIV/0!"},{"$error":"#DIV/0!"},{"$error":"#DIV/0!"},{"$error":"#DIV/0!"},{"$error":"#DIV/0!"},{"$error":"#DIV/0!"},{"$error":"#DIV/0!"},{"$error":"#DIV/0!"},{"$error":"#DIV/0!"},{"$error":"#DIV/0!"},{"$error":"#DIV/0!"},{"$error":"#DIV/0!"}]
["Emerging ",{"$error":"#DIV/0!"},{"$error":"#DIV/0!"},{"$error":"#DIV/0!"},{"$error":"#DIV/0!"},{"$error":"#DIV/0!"},{"$error":"#DIV/0!"},{"$error":"#DIV/0!"},{"$error":"#DIV/0!"},{"$error":"#DIV/0!"},{"$error":"#DIV/0!"},{"$error":"#DIV/0!"},{"$error":"#DIV/0!"},{"$error":"#DIV/0!"},{"$error":"#DIV/0!"},{"$error":"#DIV/0!"}]
["Hong Kong",685,697,695,700,684,729,739,760,759,770,754,733,761,759,761,756,758,755,753]
["Singapore",661,673,675,701,687,719,733,728,722,735,729,725,759,751,751,746,754,750,755]
["Tokyo",633,625,628,642,611,674,692,697,694,695,693,684,718,720,722,718,722,725,728]
["Seoul",432,464,455,502,462,576,615,621,651,679,686,685,710,701,718,715,718,724,705]
["Shanghai",578,527,554,568,538,655,668,693,694,724,687,656,674,690,695,690,695,698,693]
{"$rows_empty":24}
["City","GFCI 19 Rank","GFCI 19 Rating","GFCI 18 Rank","GFCI 18 Rating","Change in Rank","Change in Rating"]
{"$rows_left_out":20}
{"sheet":"North America","index":13,"n_rows":43,"n_cols":20,"rows_kept":43}
["Centre","GFCI 1","GFCI 2","GFCI 3","GFCI 4","GFCI 5","GFCI 6","GFCI 7","GFCI 8","GFCI 9","GFCI 10","GFCI 11","GFCI 12","GFCI 13","GFCI 14","GFCI 15","GFCI 16","GFCI 17","GFCI 18","GFCI 19"]
["New York",760,787,786,774,768,774,775,770,769,773,772,765,787,779,786,778,785,788,792]
["San Francisco",611,608,614,620,609,634,651,654,655,681,683,678,695,697,711,719,708,712,711]
["Boston",609,621,618,625,618,634,652,655,656,678,684,680,711,714,715,705,706,709,709]
["Washington DC",594,589,597,600,596,630,647,649,650,670,677,672,692,689,706,704,703,711,712]
["Toronto",614,613,610,624,615,647,667,656,658,680,685,681,696,699,705,703,704,714,707]
{"$rows_empty":26}
["City","GFCI 19 Rank","GFCI 19 Rating","GFCI 18 Rank","GFCI 18 Rating","Change in Rank","Change in Rating"]
["New York",2,792,2,788,"-","▲4"]
["Washington DC",7,712,10,711,"▲3","▲1"]
{"$rows_left_out":9}
{"sheet":"Latin America & the Caribbean","index":14,"n_rows":43,"n_cols":20,"rows_kept":43}
["Centre","GFCI 1","GFCI 2","GFCI 3","GFCI 4","GFCI 5","GFCI 6","GFCI 7","GFCI 8","GFCI 9","GFCI 10","GFCI 11","GFCI 12","GFCI 13","GFCI 14","GFCI 15","GFCI 16","GFCI 17","GFCI 18","GFCI 19"]
["Sao Paulo",null,434,451,471,440,560,590,573,574,607,612,619,644,643,667,666,644,672,639]
["Buenos Aires",{"$nulls":5},507,535,528,525,579,577,578,633,628,688,657]
["Mexico City",{"$nulls":5},541,563,563,561,609,610,602,628,584,605,652,623,616,626]
["Rio de Janeiro",{"$nulls":5},532,566,561,563,602,608,608,639,654,653,650,638,666,637]
["British Virgin Islands",null,null,574,584,549,584,596,582,584,611,623,624,640,626,654,639,657,658,635]
{"$rows_empty":28}
["City","GFCI 19 Rank","GFCI 19 Rating","GFCI 18 Rank","GFCI 18 Rating","Change in Rank","Change in Rating"]
["Cayman Islands",41,641,34,668,"▼7","▼27"]
["Sao Paulo",43,639,31,672,"▼12","▼33"]
{"$rows_left_out":7}
{"sheet":"Middle East & Africa ","index":15,"n_rows":41,"n_cols":20,"rows_kept":41}
["Centre","GFCI 1","GFCI 2","GFCI 3","GFCI 4","GFCI 5","GFCI 6","GFCI 7","GFCI 8","GFCI 9","GFCI 10","GFCI 11","GFCI 12","GFCI 13","GFCI 14","GFCI 15","GFCI 16","GFCI 17","GFCI 18","GFCI 19"]
["Dubai",570,575,585,597,580,617,618,607,605,622,641,648,675,671,684,694,688,704,699]
["Abu Dhabi",{"$nulls":10},618,631,649,637,678,692,685,679,675]
["Riyadh",{"$nulls":5},457,507,503,500,575,572,584,656,627,682,685,698,629,606]
["Doha",null,440,491,525,507,558,600,592,597,636,630,634,661,672,687,684,691,695,652]
["Tel Aviv",{"$nulls":13},653,692,664,684,687,676]
{"$rows_empty":25}
["City","GFCI 19 Rank","GFCI 19 Rating","GFCI 18 Rank","GFCI 18 Rating","Change in Rank","Change in Rating"]
["Dubai",13,699,16,704,"▲3","▼5"]
["Tel Aviv",25,676,25,687,"-","▼11"]
{"$rows_left_out":8}
{"sheet":"Industry Sectors","index":16,"n_rows":14,"n_cols":6,"rows_kept":14}
["Sub Indices by Industry sector."]
[]
["Rank","Investment","Banking","Government & Regulatory","Insurance","Professional Services"]
["Rank","Investment","Banking","Government & Regulatory","Insurance","Professional Services"]
[1,"New York (+1)","London (-)","London (-)","New York (-)","London (-)"]
[2,"London (-1)","New York (-)","New York (-)","London (-)","New York (-)"]
[3,"Hong Kong (-)","Hong Kong (-)","Singapore (+1)","Singapore (-)","Singapore (-)"]
[4,"Singapore (-)","Singapore (-)","Hong Kong (-1)","Hong Kong (+1)","Hong Kong (-)"]
[5,"Tokyo (+1)","Tokyo (-)","Los Angeles (+39)","Tokyo (+5)","Washington DC (-)"]
[5,"Zurich (+4)","Luxembourg (+11)","Tokyo (-1)","Los Angeles (+23)","Tokyo (+3)"]
{"$rows_left_out":5}
{"sheet":"Reputation","index":17,"n_rows":25,"n_cols":4,"rows_kept":25}
["A Comparison of the average assessment (weighted by age) with the GFCI rating.  "]
[]
["Centre - Top 10","Average Assessment","GFCI 19 Rating","Reputational Advantage"]
["Qingdao",689,594,95]
["Casablanca",750,665,85]
["Sydney",766,692,74]
["Singapore",827,755,72]
["Tokyo",794,728,66]
["Melbourne",726,669,57]
["Toronto",762,707,55]
{"$rows_left_out":16}
{"sheet":"Stability","index":18,"n_rows":89,"n_cols":6,"rows_kept":89}
["The 'Stability' of financial centres' GFCI ratings (top 40). "]
[]
["Centre","Standard Deviation of Assessments","Variance of Instrumental Factors"]
["New York",{"v":4.560701700396547,"d":"4.56"},{"v":3.1057905605546634,"d":"3.11"}]
["London",{"v":2.449489742783178,"d":"2.45"},{"v":2.6160233806197057,"d":"2.62"}]
["Hong Kong",{"v":9.565563234854496,"d":"9.57"},{"v":2.221410590735743,"d":"2.22"}]
["Singapore",{"v":8.848728722251575,"d":"8.85"},{"v":2.190953796080098,"d":"2.19"}]
["Tokyo",{"v":5.983310120660633,"d":"5.98"},{"v":2.643944568176191,"d":"2.64"}]
["Zurich",{"v":4.549725266430929,"d":"4.55"},{"v":3.282156296490768,"d":"3.28"}]
["Seoul",{"v":22.87575135378071,"d":"22.88"},{"v":2.973914042748794,"d":"2.97"}]
{"$rows_left_out":80}
{"sheet":"Assessments","index":19,"n_rows":90,"n_cols":6,"rows_kept":90}
["Valid assessments obtained in the past 24 months."]
[]
["Centre","GFCI 19 Rank","GFCI 19 Rating","Number","Average","Standard Deviation"]
["London",1,800,1166,{"v":839.1080617495712,"d":"839"},{"v":169.33420518433468,"d":"169"}]
["New York",2,792,1035,{"v":834.9758454106282,"d":"835"},{"v":182.0023482487955,"d":"182"}]
["Singapore",3,755,673,{"v":826.8945022288262,"d":"827"},{"v":143.35209990289331,"d":"143"}]
["Hong Kong",4,753,815,{"v":804.6625766871166,"d":"805"},{"v":142.73796513691303,"d":"143"}]
["Tokyo",5,728,450,{"v":793.5555555555555,"d":"794"},{"v":162.87969950742135,"d":"163"}]
["Zurich",6,714,586,{"v":741.2969283276451,"d":"741"},{"v":210.06042657746698,"d":"210"}]
["Washington DC",7,712,325,{"v":742.4615384615385,"d":"742"},{"v":178.79287979566772,"d":"179"}]
{"$rows_left_out":81}
{"sheet":"Respondents","index":20,"n_rows":34,"n_cols":2,"rows_kept":34}
["A breakdown of the respondents by region, sector and size of organisation"]
[]
["Region","Number"]
["Western Europe",816]
["Asia/Pacific",529]
["North America",255]
["Middle East & Africa",136]
["N/A",63]
["Eastern Europe & Central Asia",63]
["Latin America & the Caribbean",48]
{"$rows_left_out":25}
{"sheet":"Inst Factors","index":21,"n_rows":118,"n_cols":7,"rows_kept":118,"merged":[[2,3,2,5],[2,6,3,6],[33,3,33,5],[33,6,34,6],[50,3,50,5],[70,3,70,5],[70,6,71,6]]}
["Details of the Instrumental Factors used in the GFCI"]
[]
["Instrumental Factors","R-Sq",null,"Business Environment",null,null,"Updated since GFCI 18"]
["IF01 Office Occupancy Costs",{"$f":"HLOOKUP(A4,'[1]R-Sq'!$E$1:$DB$108,108,FALSE)","v":{"v":0.5034373173723472,"d":"0.5034"}},null,"Factor","Source","Website"]
["BE16 OECD Country Risk Classification",{"$f":"HLOOKUP(A5,'[1]R-Sq'!$E$1:$DB$108,108,FALSE)","v":{"v":0.49658171034550413,"d":"0.4966"}},null,"BE01 Business Environment Rankings","EIU","http://www.eiu.com/public/thankyou_download.aspx?activity=download&campaignid=bizenviro2014"]
["RF11 Price Levels",{"$f":"HLOOKUP(A6,'[1]R-Sq'!$E$1:$DB$108,108,FALSE)","v":{"v":0.4933836424166332,"d":"0.4934"}},null,"BE02 Ease of Doing Business Index","The World Bank","http://databank.worldbank.org/data/reports.aspx?source=doing-business","YES"]
["RF14 Innovation Cities Global Index",{"$f":"HLOOKUP(A7,'[1]R-Sq'!$E$1:$DB$108,108,FALSE)","v":{"v":0.4010031122599965,"d":"0.4010"}},null,"BE03 Operational Risk Rating","EIU","http://www.viewswire.com/index.asp?layout=homePubTypeRK","YES"]
["RF12 Global Cities Index",{"$f":"HLOOKUP(A8,'[1]R-Sq'!$E$1:$DB$108,108,FALSE)","v":{"v":0.4008439070205394,"d":"0.4008"}},null,"BE04 Real Interest Rate","The World Bank","http://databank.worldbank.org/data/reports.aspx?source=world-development-indicators","YES"]
["RF01 World Competitiveness Scoreboard",{"$f":"HLOOKUP(A9,'[1]R-Sq'!$E$1:$DB$108,108,FALSE)","v":{"v":0.3970976648578643,"d":"0.3971"}},null,"BE05 Global Services Location","AT Kearney","http://www.atkearney.com/research-studies/global-services-location-index ","YES"]
["BE18 Financial Secrecy Index",{"$f":"HLOOKUP(A10,'[1]R-Sq'!$E$1:$DB$108,108,FALSE)","v":{"v":0.37949316665358024,"d":"0.3795"}},null,"BE06 Corruption Perception Index","Transparency International","http://www.transparency.org/policy_research/surveys_indices/cpi","YES"]
{"$rows_left_out":108}